{"text_format":"1","workbook":"xlsx","n_sheets":7,"sheets":["Introduktion","Ordregiver","Tilbudsgiver","Baggrundsdata","Beregningsmetode","Standard-fremskrivning ","IB - Hospitalstekstiler"],"not_rendered":{"charts":4,"images":2,"macros":0,"external_links":4,"defined_names":35,"comments":0,"pivot_tables":0},"unopened":[],"bounds":{"document_bytes":16777216,"sheet_cells":100000,"rows_first":2000,"rows_last":500,"rows_between":2000,"halvings":0,"cell_chars":16384,"cell_head_chars":4096},"cells_cut":0,"cells_raw":0,"read":"whole","date_system":"1900"}

{"sheet":"Introduktion","index":0,"n_rows":0,"n_cols":0,"rows_kept":0,"cut":false,"hidden":false,"merged":[]}

{"sheet":"Ordregiver","index":1,"n_rows":80,"n_cols":5,"rows_kept":80,"cut":false,"hidden":false,"merged":[[22,2,22,3],[22,4,22,5],[2,1,2,3],[23,1,23,3],[31,4,31,5],[6,1,6,3],[7,1,7,3]]}
[]
[null,"TCO-værktøj til tilbudsevaluering"]
[null,"Tekstiler i sundhedssektoren til flergangsbrug"]
[]
[null,"Ordregiver"]
[]
[null,"          "]
[null,"1   Baggrundsdata"]
[null,null,"1. år for brugsperiode","årstal",2025]
[null,null,"TCO-evalueringsperiode","år"]
[]
[null,null,"Vaskeriomkostninger pr. kg tekstil gennem vaskeriet inkl. transport","kr./kg"]
[]
[null,null,"Diskonteringsrente","%/år",3.5000000000000003E-2]
[]
{"$rows_left_out":66}
{"sheet":"Tilbudsgiver","index":2,"n_rows":111,"n_cols":19,"rows_kept":111,"cut":false,"hidden":false,"merged":[[2,1,2,3],[34,1,34,3],[32,18,32,19],[6,1,6,4],[32,6,32,7],[32,4,32,5],[32,2,32,3],[32,10,32,11],[32,12,32,13],[32,14,32,15],[32,16,32,17]]}
[]
[null,"TCO-værktøj til tilbudsevaluering"]
[null,"Tekstiler i sundhedssektoren til flergangsbrug"]
[]
[null,"Tilbudsgiver"]
[]
[null,"          "]
[null,"4    Tilbudsgiver: Oplysninger om produktet"]
[null,null,"Produkttype (defineret af ordregiver)",null,{"$f":"IF(Ordregiver!$E$29=\"\",\"Ingen produktgruppe specificeret\",Ordregiver!$E$29)","v":"Ingen produktgruppe specificeret"},null,{"$f":"IF(Ordregiver!$E$29=\"\",\"Ingen produktgruppe specificeret\",Ordregiver!$E$29)","v":"Ingen produktgruppe specificeret"},null,{"$f":"IF(Ordregiver!$E$29=\"\",\"Ingen produktgruppe specificeret\",Ordregiver!$E$29)","v":"Ingen produktgruppe specificeret"},null,{"$f":"IF(Ordregiver!$E$29=\"\",\"Ingen produktgruppe specificeret\",Ordregiver!$E$29)","v":"Ingen produktgruppe specificeret"},null,{"$f":"IF(Ordregiver!$E$29=\"\",\"Ingen produktgruppe specificeret\",Ordregiver!$E$29)","v":"Ingen produktgruppe specificeret"},null,{"$f":"IF(Ordregiver!$E$29=\"\",\"Ingen produktgruppe specificeret\",Ordregiver!$E$29)","v":"Ingen produktgruppe specificeret"},null,{"$f":"IF(Ordregiver!$E$29=\"\",\"Ingen produktgruppe specificeret\",Ordregiver!$E$29)","v":"Ingen produktgruppe specificeret"},null,{"$f":"IF(Ordregiver!$E$29=\"\",\"Ingen produktgruppe specificeret\",Ordregiver!$E$29)","v":"Ingen produktgruppe specificeret"}]
[]
[null,null,"Produktets navn","Egen reference","PRODUKT 1",null,"PRODUKT 2",null,"PRODUKT 3",null,"PRODUKT 4",null,"PRODUKT 5",null,"PRODUKT 6",null,"PRODUKT 7",null,"PRODUKT 8"]
[null,null,"Produktbeskrivelse","Egen reference"]
[null,null,"Varenr. ","Egen reference"]
[]
[null,null,"Investeringsomkostninger "]
{"$rows_left_out":97}
{"sheet":"Baggrundsdata","index":3,"n_rows":69,"n_cols":15,"rows_kept":69,"cut":false,"hidden":false,"merged":[[9,2,10,3],[11,2,11,3],[13,2,13,3],[14,2,14,3],[15,2,15,3],[23,14,24,14],[12,2,12,3],[18,2,18,3],[16,2,16,3],[17,2,17,3],[19,2,19,3],[23,3,24,3],[7,2,7,13],[21,2,21,13],[50,2,50,3],[52,5,52,7],[50,5,50,8],[43,2,45,2],[46,2,48,2],[37,2,39,2],[40,2,42,2],[23,2,24,2],[25,2,27,2],[34,2,36,2],[31,2,33,2],[28,2,30,2],[23,4,23,13],[9,4,9,13],[53,5,53,7],[54,5,54,7],[55,5,55,7],[56,5,56,7],[57,5,57,7],[58,5,58,7],[59,5,59,7],[60,5,60,7],[61,5,61,7],[62,5,62,7]]}
[]
[null,null,"Baggrundsdata"]
[]
[]
[]
[null,null,"Holdbarhed"]
[]
[null,null,"Tabel 1: Tabellen nedenfor angiver, hvor meget hver produktegenskab vægtes i beregning af teoretisk levetid. Vægtningerne er defineret ud fra statistik over kasserede tekstiler hos vaskeriet midtVask. Beregning af levetid er beskrevet under \"Beregningsmetode\". Hvis der ikke benyttes denne standardvægtning, indtastes egen vægtning i arket \"Ordregiver\". "]
[]
[null,null,"Standardvægtning for forskellige produkttyper",null,"Produkttypers standardvægtning"]
[null,null,null,null,"Fladvare, vævet, alm. brug","Fladvare, vævet, operation, væsketæt","Fladvare, vævet, operation, væskeafvisende","Fyldvare, vævet, alm. brug","Fyldvare, vævet operation","Beklædning, vævet, alm. brug","Beklædning, vævet, operation, væsketæt","Beklædning, vævet, operation, væskeafvisende","Beklædning, strikket, alm. brug","Beklædning, strikket, operation"]
[null,null,"Rivstyrke",null,0.4,0.2,0.2,0.4,0.3,0.3,0.2,0.2]
[null,null,"Bristestyrke",null,null,null,null,null,null,null,null,null,0.3,0.3]
[null,null,"Dimensionsændring",null,0.05,0.15,0.15,0.05,0.2,0.2,0.1,0.1,0.3,0.3]
[null,null,"Pilling",null,0.15,0.2,0.2,0.15,0.25,0.15,0.2,0.2,0.25,0.25]
{"$rows_left_out":55}
{"sheet":"Beregningsmetode","index":4,"n_rows":0,"n_cols":0,"rows_kept":0,"cut":false,"hidden":false,"merged":[]}

{"sheet":"Standard-fremskrivning ","index":5,"n_rows":99,"n_cols":22,"rows_kept":99,"cut":false,"hidden":false,"merged":[[5,20,6,20],[5,21,6,21],[0,2,2,22],[5,0,34,0],[5,2,6,2],[5,3,6,3],[5,4,6,8],[5,9,6,11],[7,2,7,3],[8,2,8,3],[9,2,9,3],[5,18,6,18],[5,19,6,19],[5,12,6,13],[5,14,6,15],[5,16,6,17]]}
[null,null,"Emissionsfaktorer og samfundsøkonomi"]
[]
[]
[]
[]
[null,null,"Valgt referenceår:",{"$f":"Ordregiver!E9","v":2025},"El (kWh)",null,null,null,null,"Vand (m3)",null,null,"Gas (Nm3) (ledningsgas)",null,"Benzin (liter)",null,"Diesel (liter)",null,"Fyringsolie (liter)","Fjernvarme (kWh)","Samfundsøkonomiske omkostninger ved CO2-emissioner","Diskonteringsrente"]
[]
[null,null,"Beskrivelse",null,"Standard elpris (TOTAL)","Standard elpris uden afgifter, ankomst kunde (Spotpris)","Elafgift, alm. elafgift","Transport- og anvance tillæg, el","Standard-CO2-emissionsfaktorer","Standard vandpris, ankomst kunde inkl. afgifter ekskl. moms","Årlig prisstigning","Standard-CO2e-emissionsfaktor","Standard gaspris, ankomst kunde, inkl. transport og avance omkostninger, ekskl. sunk cost","Standard-CO2-emissionsfaktorer","Standard benzinpris, ankomst kunde","Standard CO2-emissionsfaktorer","Standard dieselpris, ankomst kunde","Standard CO2-emissionsfaktorer for diesel","Standard CO2-emissionsfaktorer for fyringsolie","Standard CO2-emissionsfaktorer for fjernvarme","Standard værdisætning af samfundsøkonomiske omkostninger ved CO2-emissioner","Diskonteringsrente"]
[null,null,"Enhed",null,"kr./kWh","kr./kWh","kr./kWh","kr./kWh","kg CO2e/kWh","kr./m3","%","kg CO2e/m3","kr./m3","kg CO2e/Nm3","kr./liter","kg CO2e/liter","kr./liter","kg CO2e/liter","kg CO2e/liter","kg CO2e/kWh","kr./tons CO2e","%"]
[null,null,"Kilde",null,"ENS, samfundsøkonomiske beregningsforusætninger 2022, tabel 8: https://ens.dk/sites/ens.dk/files/Analyser/soeb22.pdf","ENS, samfundsøkonomiske beregningsforusætninger 2022, tabel 8: https://ens.dk/sites/ens.dk/files/Analyser/soeb22.pdf","Energiaftale, 2018: https://kefm.dk/media/6646/energiaftale2018.pdf & 'En ny reformpakke for dansk økonomi\", 2022: https://www.skm.dk/media/10908/lempelse-af-elafgiften.pdf","ENS, samfundsøkonomiske beregningsforusætninger 2022, tabel 7, < 20MWh: https://ens.dk/sites/ens.dk/files/Analyser/soeb22.pdf","Energistyrelsen, fremtidige el- emissionsfaktorer: https://ens.dk/analyser-og-statistik/beregning-af-klimaaftryk","Fremskrivning på baggrund af DANVA statistik - se ark \"Prisudvikling for vand, DANVA\"","Årlig pristigning på baggrund af beregninger fra arket - \"Prisudvikling for vand, DANVA\"","DANVA, Vand i 2024 - 1,59 kWh/m3 *gældende EF for el: Kilde: DANVA \"Vand i tal 2024\".","ENS, samfundsøkonomiske beregningsforusætninger 2022, tabel 11: https://ens.dk/sites/ens.dk/files/Analyser/soeb22.pdf","Klimastatus og fremskrivning, 2024, national energibalance - https://www.kefm.dk/klima/klimastatus-og-fremskrivning","ENS, samfundsøkonomiske beregningsforusætninger 2022, tabel 6: https://ens.dk/sites/ens.dk/files/Analyser/soeb22.pdf","Baggrundsrapport, Viegand Maagøe 2020 for TCO - Anvender IPCC 4. vurderingsrapports Emiissionsfaktorer for benzin og diesel.","ENS, samfundsøkonomiske beregningsforusætninger 2022, tabel 6: https://ens.dk/sites/ens.dk/files/Analyser/soeb22.pdf","Baggrundsrapport, Viegand Maagøe 2020 for TCO - Anvender IPCC 4. vurderingsrapports Emiissionsfaktorer for benzin og diesel.","Beregnet fra: Energistatistik 2018 (Energistyrelsen, 2019) og UK Government GHG Conversion Factors for Company Reporting (DEFRA, 2020)","Klimastatus og fremskrivning, 2024, national energibalance - https://www.kefm.dk/klima/klimastatus-og-fremskrivning","Klimarådets anbefaling; https://klimaraadet.dk/da/rapport/statusrapport-2022","Finansministeriet, https://fm.dk/media/18371/dokumentationsnotat-for-den-samfundsoekonomiske-diskonteringsrente_7-januar-2021.pdf"]
[null,null,"Årstal","År"]
[null,null,2025,{"$f":"C12-($D$6-1)","v":1},{"$f":"F12+G12+H12","v":2.302},{"$f":"1260/1000","v":1.26},0.76300000000000001,0.27900000000000003,5.892E-2,49.29,2.8000000000000001E-2,{"$f":"1.59*I12","v":9.3682800000000011E-2},5.1625360000000011,1.1207929000000001,4.7369699999999995,2.52,4.4290575000000008,2.98,3.15,{"$f":"46.27/1000","v":4.6270000000000006E-2},1500,3.5000000000000003E-2]
[null,null,2026,{"$f":"C13-($D$6-1)","v":2},{"$f":"F13+G13+H13","v":1.67},{"$f":"660/1000","v":0.66},0.73099999999999998,0.27900000000000003,5.0799999999999998E-2,{"$f":"J12*(1+K12)","v":50.670119999999997},2.8000000000000001E-2,{"$f":"1.55*I13","v":7.8740000000000004E-2},3.1394869999999999,0.79338359999999997,4.6679849999999998,2.52,4.3586024999999999,2.98,3.15,{"$f":"43.88/1000","v":4.3880000000000002E-2},1500,3.5000000000000003E-2]
[null,null,2027,3,1.54,{"$f":"560/1000","v":0.56000000000000005},0.70099999999999996,0.27900000000000003,4.3060000000000001E-2,{"$f":"J13*(1+K13)","v":52.088883359999997},2.8000000000000001E-2,6.6742999999999997E-2,1.7023700000000002,0.38085580000000002,4.5628649999999995,2.52,4.2593250000000005,2.98,3.15,{"$f":"40.35/1000","v":4.0350000000000004E-2},1500,3.5000000000000003E-2]
[null,null,2028,4,1.4580000000000002,{"$f":"540/1000","v":0.54},0.63900000000000001,0.27900000000000003,3.542E-2,53.547372094079996,2.8000000000000001E-2,5.4900999999999998E-2,1.5638050000000001,0.15717230000000004,4.470885,2.52,4.1664525000000001,2.98,3.15,{"$f":"39.36/1000","v":3.9359999999999999E-2},1500,3.5000000000000003E-2]
{"$rows_left_out":85}
{"sheet":"IB - Hospitalstekstiler","index":6,"n_rows":201,"n_cols":31,"rows_kept":201,"cut":false,"hidden":true,"merged":[[15,21,18,21],[19,21,22,21],[23,21,26,21],[43,21,46,21],[39,21,42,21],[35,21,38,21],[31,21,34,21],[27,21,30,21]]}
[]
[null,"Levetid","Vægtning",null,"PRODUKT 1",null,"PRODUKT 2",null,"PRODUKT 3",null,"PRODUKT 4",null,"PRODUKT 5",null,"PRODUKT 6",null,"PRODUKT 7",null,"PRODUKT 8",null,null,"Vælg fra liste","Vælg fra liste",null,null,null,"Vælg fra liste","År",null,null,"Nuværende år"]
[null,null,null,null,null,null,null,null,null,null,null,null,null,null,null,null,null,null,null,null,null,"Fladvare, vævet, alm. brug","Ja",null,null,null,{"$f":"YEAR((AE3))","v":2025},1,null,null,{"$f":"TODAY()","v":"2025-11-13"}]
[null,"Rivstyrke",{"$f":"IFERROR(IF(Ordregiver!$E$31=\"Ja\",HLOOKUP(Ordregiver!$E$29,Baggrundsdata!$E$11:$N$19,2,FALSE),Ordregiver!$E43),0)","v":0},null,{"$f":"IFERROR(VLOOKUP(Tilbudsgiver!#REF!,$X$16:$Y$19,2,FALSE),0)","v":0},null,{"$f":"IFERROR(VLOOKUP(Tilbudsgiver!G$22,$X$16:$Y$19,2,FALSE),0)","v":0},null,{"$f":"IFERROR(VLOOKUP(Tilbudsgiver!I$22,$X$16:$Y$19,2,FALSE),0)","v":0},null,{"$f":"IFERROR(VLOOKUP(Tilbudsgiver!K$22,$X$16:$Y$19,2,FALSE),0)","v":0},null,{"$f":"IFERROR(VLOOKUP(Tilbudsgiver!#REF!,$X$16:$Y$19,2,FALSE),0)","v":0},null,{"$f":"IFERROR(VLOOKUP(Tilbudsgiver!O$22,$X$16:$Y$19,2,FALSE),0)","v":0},null,{"$f":"IFERROR(VLOOKUP(Tilbudsgiver!Q$22,$X$16:$Y$19,2,FALSE),0)","v":0},null,{"$f":"IFERROR(VLOOKUP(Tilbudsgiver!S$22,$X$16:$Y$19,2,FALSE),0)","v":0},null,null,"Fladvare, vævet, operation, væsketæt","Nej",null,null,null,{"$f":"AB4-1+YEAR(($AE$3))","v":2026},2]
[null,"Bristestyrke",{"$f":"IFERROR(IF(Ordregiver!$E$31=\"Ja\",HLOOKUP(Ordregiver!$E$29,Baggrundsdata!$E$11:$N$19,3,FALSE),Ordregiver!$E44),0)","v":0},null,{"$f":"IFERROR(VLOOKUP(Tilbudsgiver!E$22,$X$20:$Y$23,2,FALSE),0)","v":0},null,{"$f":"IFERROR(VLOOKUP(Tilbudsgiver!G$23,$X$20:$Y$23,2,FALSE),0)","v":0},null,{"$f":"IFERROR(VLOOKUP(Tilbudsgiver!I$23,$X$20:$Y$23,2,FALSE),0)","v":0},null,{"$f":"IFERROR(VLOOKUP(Tilbudsgiver!K$23,$X$20:$Y$23,2,FALSE),0)","v":5},null,{"$f":"IFERROR(VLOOKUP(Tilbudsgiver!M$22,$X$20:$Y$23,2,FALSE),0)","v":0},null,{"$f":"IFERROR(VLOOKUP(Tilbudsgiver!O$23,$X$20:$Y$23,2,FALSE),0)","v":5},null,{"$f":"IFERROR(VLOOKUP(Tilbudsgiver!Q$23,$X$20:$Y$23,2,FALSE),0)","v":5},null,{"$f":"IFERROR(VLOOKUP(Tilbudsgiver!S$23,$X$20:$Y$23,2,FALSE),0)","v":5},null,null,"Fladvare, vævet, operation, væskeafvisende",null,null,null,null,{"$f":"AB5-1+YEAR(($AE$3))","v":2027},3]
[null,"Dimensionsændring",{"$f":"IFERROR(IF(Ordregiver!$E$31=\"Ja\",HLOOKUP(Ordregiver!$E$29,Baggrundsdata!$E$11:$N$19,4,FALSE),Ordregiver!$E45),0)","v":0},null,{"$f":"IFERROR(VLOOKUP(Tilbudsgiver!#REF!,$X$24:$Y$27,2,FALSE),0)","v":0},null,{"$f":"IFERROR(VLOOKUP(Tilbudsgiver!G$24,$X$24:$Y$27,2,FALSE),0)","v":0},null,{"$f":"IFERROR(VLOOKUP(Tilbudsgiver!I$24,$X$24:$Y$27,2,FALSE),0)","v":0},null,{"$f":"IFERROR(VLOOKUP(Tilbudsgiver!K$24,$X$24:$Y$27,2,FALSE),0)","v":0},null,{"$f":"IFERROR(VLOOKUP(Tilbudsgiver!M$24,$X$24:$Y$27,2,FALSE),0)","v":0},null,{"$f":"IFERROR(VLOOKUP(Tilbudsgiver!O$24,$X$24:$Y$27,2,FALSE),0)","v":0},null,{"$f":"IFERROR(VLOOKUP(Tilbudsgiver!Q$24,$X$24:$Y$27,2,FALSE),0)","v":0},null,{"$f":"IFERROR(VLOOKUP(Tilbudsgiver!S$24,$X$24:$Y$27,2,FALSE),0)","v":0},null,null,"Fyldvare, vævet, alm. brug",null,null,null,null,2028,4]
[null,"Pilling",{"$f":"IFERROR(IF(Ordregiver!$E$31=\"Ja\",HLOOKUP(Ordregiver!$E$29,Baggrundsdata!$E$11:$N$19,5,FALSE),Ordregiver!$E46),0)","v":0},null,{"$f":"IFERROR(VLOOKUP(Tilbudsgiver!E$25,$X$28:$Y$31,2,FALSE),0)","v":0},null,{"$f":"IFERROR(VLOOKUP(Tilbudsgiver!G$25,$X$28:$Y$31,2,FALSE),0)","v":0},null,{"$f":"IFERROR(VLOOKUP(Tilbudsgiver!I$25,$X$28:$Y$31,2,FALSE),0)","v":0},null,{"$f":"IFERROR(VLOOKUP(Tilbudsgiver!K$25,$X$28:$Y$31,2,FALSE),0)","v":0},null,{"$f":"IFERROR(VLOOKUP(Tilbudsgiver!M$25,$X$28:$Y$31,2,FALSE),0)","v":0},null,{"$f":"IFERROR(VLOOKUP(Tilbudsgiver!O$25,$X$28:$Y$31,2,FALSE),0)","v":0},null,{"$f":"IFERROR(VLOOKUP(Tilbudsgiver!Q$25,$X$28:$Y$31,2,FALSE),0)","v":0},null,{"$f":"IFERROR(VLOOKUP(Tilbudsgiver!S$25,$X$28:$Y$31,2,FALSE),0)","v":0},null,null,"Fyldvare, vævet operation",null,null,null,null,2029,5]
[null,"Farveændring",{"$f":"IFERROR(IF(Ordregiver!$E$31=\"Ja\",HLOOKUP(Ordregiver!$E$29,Baggrundsdata!$E$11:$N$19,6,FALSE),Ordregiver!$E47),0)","v":0},null,{"$f":"IFERROR(VLOOKUP(Tilbudsgiver!E$26,$X$32:$Y$35,2,FALSE),0)","v":0},null,{"$f":"IFERROR(VLOOKUP(Tilbudsgiver!G$26,$X$32:$Y$35,2,FALSE),0)","v":0},null,{"$f":"IFERROR(VLOOKUP(Tilbudsgiver!I$26,$X$32:$Y$35,2,FALSE),0)","v":0},null,{"$f":"IFERROR(VLOOKUP(Tilbudsgiver!K$26,$X$32:$Y$35,2,FALSE),0)","v":0},null,{"$f":"IFERROR(VLOOKUP(Tilbudsgiver!M$26,$X$32:$Y$35,2,FALSE),0)","v":0},null,{"$f":"IFERROR(VLOOKUP(Tilbudsgiver!O$26,$X$32:$Y$35,2,FALSE),0)","v":0},null,{"$f":"IFERROR(VLOOKUP(Tilbudsgiver!Q$26,$X$32:$Y$35,2,FALSE),0)","v":0},null,{"$f":"IFERROR(VLOOKUP(Tilbudsgiver!S$26,$X$32:$Y$35,2,FALSE),0)","v":0},null,null,"Beklædning, vævet, alm. brug"]
[null,"Slidstyrke",{"$f":"IFERROR(IF(Ordregiver!$E$31=\"Ja\",HLOOKUP(Ordregiver!$E$29,Baggrundsdata!$E$11:$N$19,7,FALSE),Ordregiver!$E48),0)","v":0},null,{"$f":"IFERROR(VLOOKUP(Tilbudsgiver!E$27,$X$36:$Y$39,2,FALSE),0)","v":0},null,{"$f":"IFERROR(VLOOKUP(Tilbudsgiver!G$27,$X$36:$Y$39,2,FALSE),0)","v":0},null,{"$f":"IFERROR(VLOOKUP(Tilbudsgiver!I$27,$X$36:$Y$39,2,FALSE),0)","v":0},null,{"$f":"IFERROR(VLOOKUP(Tilbudsgiver!K$27,$X$36:$Y$39,2,FALSE),0)","v":0},null,{"$f":"IFERROR(VLOOKUP(Tilbudsgiver!M$27,$X$36:$Y$39,2,FALSE),0)","v":0},null,{"$f":"IFERROR(VLOOKUP(Tilbudsgiver!O$27,$X$36:$Y$39,2,FALSE),0)","v":0},null,{"$f":"IFERROR(VLOOKUP(Tilbudsgiver!Q$27,$X$36:$Y$39,2,FALSE),0)","v":0},null,{"$f":"IFERROR(VLOOKUP(Tilbudsgiver!S$27,$X$36:$Y$39,2,FALSE),0)","v":0},null,null,"Beklædning, vævet, operation, væsketæt"]
[null,"Væsketæthed",{"$f":"IFERROR(IF(Ordregiver!$E$31=\"Ja\",HLOOKUP(Ordregiver!$E$29,Baggrundsdata!$E$11:$N$19,8,FALSE),Ordregiver!$E49),0)","v":0},null,{"$f":"IFERROR(VLOOKUP(Tilbudsgiver!E$28,$X$40:$Y$43,2,FALSE),0)","v":0},null,{"$f":"IFERROR(VLOOKUP(Tilbudsgiver!G$28,$X$40:$Y$43,2,FALSE),0)","v":0},null,{"$f":"IFERROR(VLOOKUP(Tilbudsgiver!I$28,$X$40:$Y$43,2,FALSE),0)","v":0},null,{"$f":"IFERROR(VLOOKUP(Tilbudsgiver!K$28,$X$40:$Y$43,2,FALSE),0)","v":0},null,{"$f":"IFERROR(VLOOKUP(Tilbudsgiver!M$28,$X$40:$Y$43,2,FALSE),0)","v":0},null,{"$f":"IFERROR(VLOOKUP(Tilbudsgiver!O$28,$X$40:$Y$43,2,FALSE),0)","v":0},null,{"$f":"IFERROR(VLOOKUP(Tilbudsgiver!Q$28,$X$40:$Y$43,2,FALSE),0)","v":0},null,{"$f":"IFERROR(VLOOKUP(Tilbudsgiver!S$28,$X$40:$Y$43,2,FALSE),0)","v":0},null,null,"Beklædning, vævet, operation, væskeafvisende"]
[null,"Vandafvisning",{"$f":"IFERROR(IF(Ordregiver!$E$31=\"Ja\",HLOOKUP(Ordregiver!$E$29,Baggrundsdata!$E$11:$N$19,9,FALSE),Ordregiver!$E50),0)","v":0},null,{"$f":"IFERROR(VLOOKUP(Tilbudsgiver!E$29,$X$44:$Y$47,2,FALSE),0)","v":0},null,{"$f":"IFERROR(VLOOKUP(Tilbudsgiver!G$29,$X$44:$Y$47,2,FALSE),0)","v":0},null,{"$f":"IFERROR(VLOOKUP(Tilbudsgiver!I$29,$X$44:$Y$47,2,FALSE),0)","v":0},null,{"$f":"IFERROR(VLOOKUP(Tilbudsgiver!K$29,$X$44:$Y$47,2,FALSE),0)","v":0},null,{"$f":"IFERROR(VLOOKUP(Tilbudsgiver!M$29,$X$44:$Y$47,2,FALSE),0)","v":0},null,{"$f":"IFERROR(VLOOKUP(Tilbudsgiver!O$29,$X$44:$Y$47,2,FALSE),0)","v":0},null,{"$f":"IFERROR(VLOOKUP(Tilbudsgiver!Q$29,$X$44:$Y$47,2,FALSE),0)","v":0},null,{"$f":"IFERROR(VLOOKUP(Tilbudsgiver!S$29,$X$44:$Y$47,2,FALSE),0)","v":0},null,null,"Beklædning, strikket, alm. brug"]
[null,"Samlet",null,null,{"$f":"ROUND(SUMPRODUCT($C$4:$C$11,E4:E11),0)","v":0},null,{"$f":"ROUND(SUMPRODUCT($C$4:$C$11,G4:G11),0)","v":0},null,{"$f":"ROUND(SUMPRODUCT($C$4:$C$11,I4:I11),0)","v":0},null,{"$f":"ROUND(SUMPRODUCT($C$4:$C$11,K4:K11),0)","v":0},null,{"$f":"ROUND(SUMPRODUCT($C$4:$C$11,M4:M11),0)","v":0},null,{"$f":"ROUND(SUMPRODUCT($C$4:$C$11,O4:O11),0)","v":0},null,{"$f":"ROUND(SUMPRODUCT($C$4:$C$11,Q4:Q11),0)","v":0},null,{"$f":"ROUND(SUMPRODUCT($C$4:$C$11,S4:S11),0)","v":0},null,null,"Beklædning, strikket, operation"]
[null,"Levetidsfaktor",null,null,{"$f":"VLOOKUP(E12,Baggrundsdata!$C$54:$D$69,2,)","v":0.67},null,{"$f":"VLOOKUP(G12,Baggrundsdata!$C$54:$D$69,2,)","v":0.67},null,{"$f":"VLOOKUP(I12,Baggrundsdata!$C$54:$D$69,2,)","v":0.67},null,{"$f":"VLOOKUP(K12,Baggrundsdata!$C$54:$D$69,2,)","v":0.67},null,{"$f":"VLOOKUP(M12,Baggrundsdata!$C$54:$D$69,2,)","v":0.67},null,{"$f":"VLOOKUP(O12,Baggrundsdata!$C$54:$D$69,2,)","v":0.67},null,{"$f":"VLOOKUP(Q12,Baggrundsdata!$C$54:$D$69,2,)","v":0.67},null,{"$f":"VLOOKUP(S12,Baggrundsdata!$C$54:$D$69,2,)","v":0.67}]
[null,"Levetid",null,null,{"$f":"IFERROR(ROUNDUP(VLOOKUP(Ordregiver!$E$29,Baggrundsdata!$F$54:$I$66,4,FALSE)*E13,0),0)","v":0},null,{"$f":"IFERROR(ROUNDUP(VLOOKUP(Ordregiver!$E$29,Baggrundsdata!$F$54:$I$66,4,FALSE)*G13,0),0)","v":0},null,{"$f":"IFERROR(ROUNDUP(VLOOKUP(Ordregiver!$E$29,Baggrundsdata!$F$54:$I$66,4,FALSE)*I13,0),0)","v":0},null,{"$f":"IFERROR(ROUNDUP(VLOOKUP(Ordregiver!$E$29,Baggrundsdata!$F$54:$I$66,4,FALSE)*K13,0),0)","v":0},null,{"$f":"IFERROR(ROUNDUP(VLOOKUP(Ordregiver!$E$29,Baggrundsdata!$F$54:$I$66,4,FALSE)*M13,0),0)","v":0},null,{"$f":"IFERROR(ROUNDUP(VLOOKUP(Ordregiver!$E$29,Baggrundsdata!$F$54:$I$66,4,FALSE)*O13,0),0)","v":0},null,{"$f":"IFERROR(ROUNDUP(VLOOKUP(Ordregiver!$E$29,Baggrundsdata!$F$54:$I$66,4,FALSE)*Q13,0),0)","v":0},null,{"$f":"IFERROR(ROUNDUP(VLOOKUP(Ordregiver!$E$29,Baggrundsdata!$F$54:$I$66,4,FALSE)*S13,0),0)","v":0}]
[null,null,null,null,null,null,null,null,null,null,null,null,null,null,null,null,null,null,null,null,null,"Performance","Niveau","Grænseværdi","Point"]
{"$rows_left_out":186}